Target
D-amino-acid oxidase
Ligand
BDBM210777
Substrate
Meas. Tech.
In Vitro Enzyme Assay
IC50
10.00±n/a nM
Citation
 Farnaby, WFieldhouse, CHazel, KKerr, CKinsella, NLivermore, DMerchant, KMiller, D Pyridazinone compounds and their use as DAAO inhibitors US Patent  US11129828 Publication Date 9/28/2021 
Target
Name:
D-amino-acid oxidase
Synonyms:
D-amino-acid oxidase (DAAO) DAMOX OXDA_HUMAN
Type:
Homodimer
Mol. Mass.:
39476.06
Organism:
Homo sapiens (Human)
Description:
P14920
Residue:
347
  
Inhibitor
Name:
BDBM210777
Synonyms:
US10463663, Example 9 US9290456, 9 | US9931340, Example 9
Type:
Small organic molecule
Emp. Form.:
C12H10F2N2O2
Mol. Mass.:
252.2168
SMILES:
Oc1cc(CCc2ccc(F)c(F)c2)n[nH]c1=O
: