Target
D-amino-acid oxidase
Ligand
BDBM210808
Substrate
Meas. Tech.
In Vitro Enzyme Assay
IC50
15.0±n/a nM
Citation
 Farnaby, WFieldhouse, CHazel, KKerr, CKinsella, NLivermore, DMerchant, KMiller, D Pyridazinone compounds and their use as DAAO inhibitors US Patent  US11129828 Publication Date 9/28/2021 
Target
Name:
D-amino-acid oxidase
Synonyms:
D-amino-acid oxidase (DAAO) DAMOX OXDA_HUMAN
Type:
Homodimer
Mol. Mass.:
39476.06
Organism:
Homo sapiens (Human)
Description:
P14920
Residue:
347
  
Inhibitor
Name:
BDBM210808
Synonyms:
US10463663, Example 46 US9290456, 46 | US9931340, Example 46
Type:
Small organic molecule
Emp. Form.:
C11H9FN2O2
Mol. Mass.:
220.1998
SMILES:
Oc1cc(Cc2ccccc2F)n[nH]c1=O
: