Target
Monoglyceride lipase
Ligand
BDBM521178
Substrate
Meas. Tech.
In Vitro Competitive Activity-Based Protein Profiling
IC50
<100±n/a nM
Citation
 Grice, CAWeber, ODBuzard, DJShaghafi, MBWiener, JJCisar, JSDuncan, KK Pyrazole MAGL inhibitors US Patent  US11149037 Publication Date 10/19/2021 
Target
Name:
Monoglyceride lipase
Synonyms:
HU-K5 Lysophospholipase-like MGL MGLL_HUMAN
Type:
Hydrolase
Mol. Mass.:
33264.56
Organism:
Homo sapiens (Human)
Description:
Human recombinant MGL (Cayman Chemical, cat# 10008354).
Residue:
303
  
Inhibitor
Name:
BDBM521178
Synonyms:
US11149037, Example 11
Type:
Small organic molecule
Emp. Form.:
C22H30ClFN6O3S
Mol. Mass.:
513.028
SMILES:
C[C@H](N1CCN(CC1)C(=O)n1ccc(NS(C)(=O)=O)n1)c1ccc(Cl)c(c1)N1CCC(F)CC1
: