Target
Monoglyceride lipase
Ligand
BDBM521435
Substrate
Meas. Tech.
In Vitro Competitive Activity-Based Protein Profiling
IC50
<100±n/a nM
Citation
 Grice, CAWeber, ODBuzard, DJShaghafi, MBWiener, JJCisar, JSDuncan, KK Pyrazole MAGL inhibitors US Patent  US11149037 Publication Date 10/19/2021 
Target
Name:
Monoglyceride lipase
Synonyms:
HU-K5 Lysophospholipase-like MGL MGLL_HUMAN
Type:
Hydrolase
Mol. Mass.:
33264.56
Organism:
Homo sapiens (Human)
Description:
Human recombinant MGL (Cayman Chemical, cat# 10008354).
Residue:
303
  
Inhibitor
Name:
BDBM521435
Synonyms:
US11149037, Example 13
Type:
Small organic molecule
Emp. Form.:
C23H26Cl2N6O2
Mol. Mass.:
489.398
SMILES:
CC(=O)Nc1ccn(n1)C(=O)N1CCC2(CCCN2Cc2cc3cc(Cl)cc(Cl)c3[nH]2)CC1
: