Target
Fatty-acid amide hydrolase 1
Ligand
BDBM521437
Substrate
Meas. Tech.
In Vitro Competitive Activity-Based Protein Profiling
IC50
550±n/a nM
Citation
 Grice, CAWeber, ODBuzard, DJShaghafi, MBWiener, JJCisar, JSDuncan, KK Pyrazole MAGL inhibitors US Patent  US11149037 Publication Date 10/19/2021 
Target
Name:
Fatty-acid amide hydrolase 1
Synonyms:
Anandamide amidohydrolase FAAH FAAH1_HUMAN Fatty-acid amide hydrolase (FAAH) Oleamide hydrolase 1
Type:
Protein
Mol. Mass.:
63071.19
Organism:
Homo sapiens (Human)
Description:
O00519
Residue:
579
  
Inhibitor
Name:
BDBM521437
Synonyms:
US11149037, Example 18
Type:
Small organic molecule
Emp. Form.:
C25H26ClN5O3
Mol. Mass.:
479.959
SMILES:
CC(=O)Nc1ccn(n1)C(=O)N1CC2CN(Cc3cccc(Oc4ccccc4Cl)c3)CC2C1
: