Target
Monoglyceride lipase
Ligand
BDBM521439
Substrate
Meas. Tech.
In Vitro Competitive Activity-Based Protein Profiling
IC50
<100±n/a nM
Citation
 Grice, CAWeber, ODBuzard, DJShaghafi, MBWiener, JJCisar, JSDuncan, KK Pyrazole MAGL inhibitors US Patent  US11149037 Publication Date 10/19/2021 
Target
Name:
Monoglyceride lipase
Synonyms:
HU-K5 Lysophospholipase-like MGL MGLL_HUMAN
Type:
Hydrolase
Mol. Mass.:
33264.56
Organism:
Homo sapiens (Human)
Description:
Human recombinant MGL (Cayman Chemical, cat# 10008354).
Residue:
303
  
Inhibitor
Name:
BDBM521439
Synonyms:
US11149037, Example 22
Type:
Small organic molecule
Emp. Form.:
C24H29F3N6O3
Mol. Mass.:
506.5207
SMILES:
CC(=O)Nc1ccn(n1)C(=O)N1CCN(Cc2ccc(cc2C(F)(F)F)N2CC3COCC3C2)CC1
: