Target
Monoglyceride lipase
Ligand
BDBM521442
Substrate
Meas. Tech.
In Vitro Competitive Activity-Based Protein Profiling
IC50
<100±n/a nM
Citation
 Grice, CAWeber, ODBuzard, DJShaghafi, MBWiener, JJCisar, JSDuncan, KK Pyrazole MAGL inhibitors US Patent  US11149037 Publication Date 10/19/2021 
Target
Name:
Monoglyceride lipase
Synonyms:
HU-K5 Lysophospholipase-like MGL MGLL_HUMAN
Type:
Hydrolase
Mol. Mass.:
33264.56
Organism:
Homo sapiens (Human)
Description:
Human recombinant MGL (Cayman Chemical, cat# 10008354).
Residue:
303
  
Inhibitor
Name:
BDBM521442
Synonyms:
US11149037, Example 34
Type:
Small organic molecule
Emp. Form.:
C20H28ClN5O5S
Mol. Mass.:
485.985
SMILES:
CC(C)(O)COc1cccc(CN2CCN(CC2)C(=O)n2ccc(NS(C)(=O)=O)n2)c1Cl
: