Target
Monoglyceride lipase
Ligand
BDBM521447
Substrate
Meas. Tech.
In Vitro Competitive Activity-Based Protein Profiling
IC50
<100±n/a nM
Citation
 Grice, CAWeber, ODBuzard, DJShaghafi, MBWiener, JJCisar, JSDuncan, KK Pyrazole MAGL inhibitors US Patent  US11149037 Publication Date 10/19/2021 
Target
Name:
Monoglyceride lipase
Synonyms:
HU-K5 Lysophospholipase-like MGL MGLL_HUMAN
Type:
Hydrolase
Mol. Mass.:
33264.56
Organism:
Homo sapiens (Human)
Description:
Human recombinant MGL (Cayman Chemical, cat# 10008354).
Residue:
303
  
Inhibitor
Name:
BDBM521447
Synonyms:
N-(1-(4-((6- (Trifluoromethyl) benzo[b] thiophen-2-yl) methyl) piperazine-1- carbonyl)-1H- pyrazol-3-yl) methane- sulfonamide | US11149037, Example 52
Type:
Small organic molecule
Emp. Form.:
C19H20F3N5O3S2
Mol. Mass.:
487.519
SMILES:
CS(=O)(=O)Nc1ccn(n1)C(=O)N1CCN(Cc2cc3ccc(cc3s2)C(F)(F)F)CC1
: