Target
Monoglyceride lipase
Ligand
BDBM521448
Substrate
Meas. Tech.
In Vitro Competitive Activity-Based Protein Profiling
IC50
<100±n/a nM
Citation
 Grice, CAWeber, ODBuzard, DJShaghafi, MBWiener, JJCisar, JSDuncan, KK Pyrazole MAGL inhibitors US Patent  US11149037 Publication Date 10/19/2021 
Target
Name:
Monoglyceride lipase
Synonyms:
HU-K5 Lysophospholipase-like MGL MGLL_HUMAN
Type:
Hydrolase
Mol. Mass.:
33264.56
Organism:
Homo sapiens (Human)
Description:
Human recombinant MGL (Cayman Chemical, cat# 10008354).
Residue:
303
  
Inhibitor
Name:
BDBM521448
Synonyms:
N-(1-(2-(4- Chloro-2- (pyrrolidin-1- yl)benzyl)-2,8- diazaspiro[4.5] decane-8- carbonyl)-1H- pyrazol-3-yl) methane- sulfonamide | US11149037, Example 63
Type:
Small organic molecule
Emp. Form.:
C24H33ClN6O3S
Mol. Mass.:
521.075
SMILES:
CS(=O)(=O)Nc1ccn(n1)C(=O)N1CCC2(CCN(Cc3ccc(Cl)cc3N3CCCC3)C2)CC1
: