Target
Fatty-acid amide hydrolase 1
Ligand
BDBM521454
Substrate
Meas. Tech.
In Vitro Competitive Activity-Based Protein Profiling
IC50
550±n/a nM
Citation
 Grice, CAWeber, ODBuzard, DJShaghafi, MBWiener, JJCisar, JSDuncan, KK Pyrazole MAGL inhibitors US Patent  US11149037 Publication Date 10/19/2021 
Target
Name:
Fatty-acid amide hydrolase 1
Synonyms:
Anandamide amidohydrolase FAAH FAAH1_HUMAN Fatty-acid amide hydrolase (FAAH) Oleamide hydrolase 1
Type:
Protein
Mol. Mass.:
63071.19
Organism:
Homo sapiens (Human)
Description:
O00519
Residue:
579
  
Inhibitor
Name:
BDBM521454
Synonyms:
N-(1-(5-(3- Chloro-5- fluorobenzyl) octahydro- pyrrolo[3,4-c] pyrrole-2- carbonyl)-1H- pyrazol-3- yl)acetamide | US11149037, Example 145
Type:
Small organic molecule
Emp. Form.:
C19H21ClFN5O2
Mol. Mass.:
405.854
SMILES:
CC(=O)Nc1ccn(n1)C(=O)N1CC2CN(Cc3cc(F)cc(Cl)c3)CC2C1
: