Target
Fatty-acid amide hydrolase 1
Ligand
BDBM521455
Substrate
Meas. Tech.
In Vitro Competitive Activity-Based Protein Profiling
IC50
5500±n/a nM
Citation
 Grice, CAWeber, ODBuzard, DJShaghafi, MBWiener, JJCisar, JSDuncan, KK Pyrazole MAGL inhibitors US Patent  US11149037 Publication Date 10/19/2021 
Target
Name:
Fatty-acid amide hydrolase 1
Synonyms:
Anandamide amidohydrolase FAAH FAAH1_HUMAN Fatty-acid amide hydrolase (FAAH) Oleamide hydrolase 1
Type:
Protein
Mol. Mass.:
63071.19
Organism:
Homo sapiens (Human)
Description:
O00519
Residue:
579
  
Inhibitor
Name:
BDBM521455
Synonyms:
N-(1-(5-(3- Chloro-5- (trifluoromethyl) benzyl)octa- hydropyrrolo [3,4-c]pyrrole- 2-carbonyl)- 1H-pyrazol-3- yl)acetamide | US11149037, Example 146
Type:
Small organic molecule
Emp. Form.:
C20H21ClF3N5O2
Mol. Mass.:
455.861
SMILES:
CC(=O)Nc1ccn(n1)C(=O)N1CC2CN(Cc3cc(Cl)cc(c3)C(F)(F)F)CC2C1
: