Target
Fatty-acid amide hydrolase 1
Ligand
BDBM521456
Substrate
Meas. Tech.
In Vitro Competitive Activity-Based Protein Profiling
IC50
550±n/a nM
Citation
 Grice, CAWeber, ODBuzard, DJShaghafi, MBWiener, JJCisar, JSDuncan, KK Pyrazole MAGL inhibitors US Patent  US11149037 Publication Date 10/19/2021 
Target
Name:
Fatty-acid amide hydrolase 1
Synonyms:
Anandamide amidohydrolase FAAH FAAH1_HUMAN Fatty-acid amide hydrolase (FAAH) Oleamide hydrolase 1
Type:
Protein
Mol. Mass.:
63071.19
Organism:
Homo sapiens (Human)
Description:
O00519
Residue:
579
  
Inhibitor
Name:
BDBM521456
Synonyms:
N-(1-(4-(3- (4-Chloro- phenoxy) benzyl) piperazine- 1-carbonyl)- 1H-pyrazol-3- yl)methane- sulfonamide | US11149037, Example 149
Type:
Small organic molecule
Emp. Form.:
C22H24ClN5O4S
Mol. Mass.:
489.975
SMILES:
CS(=O)(=O)Nc1ccn(n1)C(=O)N1CCN(Cc2cccc(Oc3ccc(Cl)cc3)c2)CC1
: