Target
Fatty-acid amide hydrolase 1
Ligand
BDBM521458
Substrate
Meas. Tech.
In Vitro Competitive Activity-Based Protein Profiling
IC50
5500±n/a nM
Citation
 Grice, CAWeber, ODBuzard, DJShaghafi, MBWiener, JJCisar, JSDuncan, KK Pyrazole MAGL inhibitors US Patent  US11149037 Publication Date 10/19/2021 
Target
Name:
Fatty-acid amide hydrolase 1
Synonyms:
Anandamide amidohydrolase FAAH FAAH1_HUMAN Fatty-acid amide hydrolase (FAAH) Oleamide hydrolase 1
Type:
Protein
Mol. Mass.:
63071.19
Organism:
Homo sapiens (Human)
Description:
O00519
Residue:
579
  
Inhibitor
Name:
BDBM521458
Synonyms:
N-(1-(2-(6- (Trifluoro- methyl) benzo[b] thiophene-2- carbonyl)-2,8- diazaspiro[4.5] decane-8- carbonyl)-1H- pyrazol-3- yl)acetamide | US11149037, Example 154
Type:
Small organic molecule
Emp. Form.:
C24H24F3N5O3S
Mol. Mass.:
519.539
SMILES:
CC(=O)Nc1ccn(n1)C(=O)N1CCC2(CCN(C2)C(=O)c2cc3ccc(cc3s2)C(F)(F)F)CC1
: