Target
Monoglyceride lipase
Ligand
BDBM521459
Substrate
Meas. Tech.
In Vitro Competitive Activity-Based Protein Profiling
IC50
<100±n/a nM
Citation
 Grice, CAWeber, ODBuzard, DJShaghafi, MBWiener, JJCisar, JSDuncan, KK Pyrazole MAGL inhibitors US Patent  US11149037 Publication Date 10/19/2021 
Target
Name:
Monoglyceride lipase
Synonyms:
HU-K5 Lysophospholipase-like MGL MGLL_HUMAN
Type:
Hydrolase
Mol. Mass.:
33264.56
Organism:
Homo sapiens (Human)
Description:
Human recombinant MGL (Cayman Chemical, cat# 10008354).
Residue:
303
  
Inhibitor
Name:
BDBM521459
Synonyms:
N-(1-(5-(3- Chloro-5- (pyrrolidin- 1-yl)benzyl) octahydro pyrrolo[3,4-c] pyrrole-2- carbonyl)-1H- pyrazol-3- yl)acetamide | US11149037, Example 172
Type:
Small organic molecule
Emp. Form.:
C23H29ClN6O2
Mol. Mass.:
456.968
SMILES:
CC(=O)Nc1ccn(n1)C(=O)N1CC2CN(Cc3cc(Cl)cc(c3)N3CCCC3)CC2C1
: