Target
Monoglyceride lipase
Ligand
BDBM521468
Substrate
Meas. Tech.
In Vitro Competitive Activity-Based Protein Profiling
IC50
<100±n/a nM
Citation
 Grice, CAWeber, ODBuzard, DJShaghafi, MBWiener, JJCisar, JSDuncan, KK Pyrazole MAGL inhibitors US Patent  US11149037 Publication Date 10/19/2021 
Target
Name:
Monoglyceride lipase
Synonyms:
HU-K5 Lysophospholipase-like MGL MGLL_HUMAN
Type:
Hydrolase
Mol. Mass.:
33264.56
Organism:
Homo sapiens (Human)
Description:
Human recombinant MGL (Cayman Chemical, cat# 10008354).
Residue:
303
  
Inhibitor
Name:
BDBM521468
Synonyms:
N-(1-(4-(((5- Chloro-2- (trifluoromethyl) benzyl)(methyl) amino)methyl) piperidine- 1-carbonyl)- 1H-pyrazol-3- yl)methane- sulfonamide | US11149037, Example 184
Type:
Small organic molecule
Emp. Form.:
C20H25ClF3N5O3S
Mol. Mass.:
507.957
SMILES:
CN(CC1CCN(CC1)C(=O)n1ccc(NS(C)(=O)=O)n1)Cc1cc(Cl)ccc1C(F)(F)F
: