Target
Monoglyceride lipase
Ligand
BDBM521469
Substrate
Meas. Tech.
In Vitro Competitive Activity-Based Protein Profiling
IC50
<100±n/a nM
Citation
 Grice, CAWeber, ODBuzard, DJShaghafi, MBWiener, JJCisar, JSDuncan, KK Pyrazole MAGL inhibitors US Patent  US11149037 Publication Date 10/19/2021 
Target
Name:
Monoglyceride lipase
Synonyms:
HU-K5 Lysophospholipase-like MGL MGLL_HUMAN
Type:
Hydrolase
Mol. Mass.:
33264.56
Organism:
Homo sapiens (Human)
Description:
Human recombinant MGL (Cayman Chemical, cat# 10008354).
Residue:
303
  
Inhibitor
Name:
BDBM521469
Synonyms:
(S)-N-(1-(4- (3-(4-Fluoro- piperidin- 1-yl)-4- (trifluoromethyl) benzyl)-3- methyl- piperazine- 1-carbonyl)- 1H-pyrazol-3- | US11149037, Example 187
Type:
Small organic molecule
Emp. Form.:
C23H30F4N6O3S
Mol. Mass.:
546.581
SMILES:
C[C@H]1CN(CCN1Cc1ccc(c(c1)N1CCC(F)CC1)C(F)(F)F)C(=O)n1ccc(NS(C)(=O)=O)n1
: