Target
Chymotrypsinogen B
Ligand
BDBM521748
Substrate
Meas. Tech.
Chromogenic Enzyme Activity Assays
Ki
>50000±n/a nM
Citation
 Kaiser, MKöcher, SRey, JBongard, JEhrmann, MResch, S Tailored cyclodepsipeptides as potent non-covalent serine protease inhibitors US Patent  US11149067 Publication Date 10/19/2021 
Target
Name:
Chymotrypsinogen B
Synonyms:
Beta-chymotrypsin CTRB1 Chymotrypsin B chain A Chymotrypsin B chain C Synonyms=CTRB
Type:
PROTEIN
Mol. Mass.:
27713.98
Organism:
Homo sapiens (Human)
Description:
ChEMBL_10909
Residue:
263
  
Inhibitor
Name:
BDBM521748
Synonyms:
US11149067, Compound Ahp7
Type:
Small organic molecule
Emp. Form.:
C43H66N8O12
Mol. Mass.:
887.0305
SMILES:
CC(C)C[C@@H]1N2[C@H](O)CC[C@H](NC(=O)[C@@H](NC(=O)[C@@H](NC(=O)[C@H](C)NC(=O)C(C)NC(=O)OCc3ccccc3)[C@@H](C)OC(=O)[C@@H](NC(=O)[C@H](C)N(C)C1=O)C(C)C)C(C)C)C2=O
: