Target
Tyrosine-protein kinase ABL1
Ligand
BDBM524048
Substrate
Meas. Tech.
KINOMEscan competition binding assay
Kd
0.910±n/a nM
Citation
 Lu, DQiao, CFu, BDuddupudi, ALWu, Z Functionalized pyrano[2,3-D]pyrimidin-7-one derivatives and methods for their preparation and use US Patent  US11136333 Publication Date 10/5/2021 
Target
Name:
Tyrosine-protein kinase ABL1
Synonyms:
ABL ABL1_HUMAN JTK7 Proto-oncogene tyrosine-protein kinase ABL1 Tyrosine-protein kinase ABL V-abl Abelson murine leukemia viral oncogene homolog 1 p150 | tyrosine-protein kinase ABL1 isoform a
Type:
Enzyme
Mol. Mass.:
122897.30
Organism:
Homo sapiens (Human)
Description:
P00519
Residue:
1130
  
Inhibitor
Name:
BDBM524048
Synonyms:
US11136333, Compound 12g
Type:
Small organic molecule
Emp. Form.:
C21H14Cl2N4O3
Mol. Mass.:
441.267
SMILES:
CC(=O)Nc1cccc(Nc2ncc3cc(-c4c(Cl)cccc4Cl)c(=O)oc3n2)c1
: