Target
Sodium channel protein type 8 subunit alpha
Ligand
BDBM526220
Substrate
Meas. Tech.
Electrophysiological Assay (In Vitro Assay)
IC50
1.000±n/a nM
Citation
 Andrez, JBogucki, DEBurford, KNChowdhury, SCohen, CJDecker, SMDehnhardt, CMDevita, RJEmpfield, JRFocken, TGrimwood, MEHasan, SAJia, QJohnson, Jr., JPWilson, MSZenova, AY Benzenesulfonamide compouds and their use as therapeutic agents US Patent  US11174268 Publication Date 11/16/2021 
Target
Name:
Sodium channel protein type 8 subunit alpha
Synonyms:
MED SCN8A_HUMAN Sodium channel protein type 8 subunit alpha Voltage-gated sodium channel subunit alpha Nav1.6 | ep nav1.6
Type:
PROTEIN
Mol. Mass.:
225271.59
Organism:
Homo sapiens (Human)
Description:
ChEMBL_1516902
Residue:
1980
  
Inhibitor
Name:
BDBM526220
Synonyms:
4-((2-(azetidin-1-ylmethyl)benzyl)amino)-3-chloro-2,6-difluoro-N-(1,2,4-thiadiazol-5-yl)benzenesulfonamide formate | US11174268, Example 327
Type:
Small organic molecule
Emp. Form.:
C19H18ClF2N5O2S2
Mol. Mass.:
485.958
SMILES:
Fc1cc(NCc2ccccc2CN2CCC2)c(Cl)c(F)c1S(=O)(=O)Nc1ncns1
: