Target
Sodium channel protein type 8 subunit alpha
Ligand
BDBM526223
Substrate
Meas. Tech.
Sodium Influx Assay (In Vitro Assay)
IC50
1.000±n/a nM
Citation
 Andrez, JBogucki, DEBurford, KNChowdhury, SCohen, CJDecker, SMDehnhardt, CMDevita, RJEmpfield, JRFocken, TGrimwood, MEHasan, SAJia, QJohnson, Jr., JPWilson, MSZenova, AY Benzenesulfonamide compouds and their use as therapeutic agents US Patent  US11174268 Publication Date 11/16/2021 
Target
Name:
Sodium channel protein type 8 subunit alpha
Synonyms:
MED SCN8A_HUMAN Sodium channel protein type 8 subunit alpha Voltage-gated sodium channel subunit alpha Nav1.6 | ep nav1.6
Type:
PROTEIN
Mol. Mass.:
225271.59
Organism:
Homo sapiens (Human)
Description:
ChEMBL_1516902
Residue:
1980
  
Inhibitor
Name:
BDBM526223
Synonyms:
4-((2-(azetidin-1-ylmethyl)benzyl)amino)-2,6-difluoro-3-methyl-N-(1,2,4-thiadiazol-5-yl)benzenesulfonamide | US11174268, Example 330
Type:
Small organic molecule
Emp. Form.:
C20H21F2N5O2S2
Mol. Mass.:
465.54
SMILES:
Cc1c(NCc2ccccc2CN2CCC2)cc(F)c(c1F)S(=O)(=O)Nc1ncns1
: