Target
N-formyl peptide receptor 2
Ligand
BDBM454206
Substrate
Meas. Tech.
FPR2 and FPR1 Cyclic Adenosine Monophosphate (cAMP) Assays
EC50
0.280±n/a nM
Citation
 Wurtz, NRShirude, PSViet, AQ Piperidinone formyl peptide 2 receptor and formyl peptide 1 receptor agonists US Patent  US11186544 Publication Date 11/30/2021 
Target
Name:
N-formyl peptide receptor 2
Synonyms:
ALXR, FPRL1, FPR2 FPR2 FPRH1 Formyl Peptide Receptor-Like 1 LXA4 receptor Lipoxin A4 receptor RFP | hFPRL
Type:
G Protein-Coupled Receptor (GPCR)
Mol. Mass.:
38968.35
Organism:
Homo sapiens (Human)
Description:
P25090
Residue:
351
  
Inhibitor
Name:
BDBM454206
Synonyms:
US10717708, Example 199 US11530183, Example 199
Type:
Small organic molecule
Emp. Form.:
C26H28N4O5S
Mol. Mass.:
508.589
SMILES:
COc1ccc(NC(=O)N[C@@H]2CCCN(C2=O)c2ccc(cc2)-c2ccccc2NS(C)(=O)=O)cc1
: