Target
Plasma serine protease inhibitor
Ligand
BDBM528106
Substrate
Meas. Tech.
Determination of Enzyme Selectivity
IC50
>40000±n/a nM
Citation
 Davie, RLEdwards, HJEvans, DMHodgson, STPethen, SJRooker, DP Pyrazole derivatives as plasma kallikrein inhibitors US Patent  US11180484 Publication Date 11/23/2021 
Target
Name:
Plasma serine protease inhibitor
Synonyms:
Acrosomal serine protease inhibitor PAI-3 PCI PROCI Protein C inhibitor Serpin A5
Type:
Protein
Mol. Mass.:
45687.25
Organism:
Human
Description:
P05154
Residue:
406
  
Inhibitor
Name:
BDBM528106
Synonyms:
N-{[5-methoxy-2-(1,2,3,4-tetrazol-1-yl)phenyl]methyl}-3-(methoxymethyl)-1-({4-[(2- oxopyridin-1-yl)methyl]phenyl}methyl)pyrazole-4-carboxamide | US11180484, Example 40
Type:
Small organic molecule
Emp. Form.:
C28H28N8O4
Mol. Mass.:
540.5731
SMILES:
COCc1nn(Cc2ccc(Cn3ccccc3=O)cc2)cc1C(=O)NCc1cc(OC)ccc1-n1cnnn1
: