Target
Fatty-acid amide hydrolase 1
Ligand
BDBM529436
Substrate
Meas. Tech.
FAAH, CB1, and CB2 Inhibition Assay
IC50
2600±n/a nM
Citation
 Au, VHarichian, BMarrero, D Personal care compositions comprising fatty acid amide derivatives US Patent  US11202743 Publication Date 12/21/2021 
Target
Name:
Fatty-acid amide hydrolase 1
Synonyms:
Anandamide amidohydrolase FAAH FAAH1_HUMAN Fatty-acid amide hydrolase (FAAH) Oleamide hydrolase 1
Type:
Protein
Mol. Mass.:
63071.19
Organism:
Homo sapiens (Human)
Description:
O00519
Residue:
579
  
Inhibitor
Name:
BDBM529436
Synonyms:
US11202743, Compound 2
Type:
Small organic molecule
Emp. Form.:
C21H37NO3
Mol. Mass.:
351.5234
SMILES:
CCCCC\C=C/C=C/CCCCCCCCC(=O)NC(C)C(O)=O
: