Target
Cannabinoid receptor 2
Ligand
BDBM529437
Substrate
Meas. Tech.
FAAH, CB1, and CB2 Inhibition Assay
IC50
26000±n/a nM
Citation
 Au, VHarichian, BMarrero, D Personal care compositions comprising fatty acid amide derivatives US Patent  US11202743 Publication Date 12/21/2021 
Target
Name:
Cannabinoid receptor 2
Synonyms:
CANNABINOID CB2 CB2 CB2B CNR2_HUMAN Cannabinoid CB2 receptor Cannabinoid receptor 2 (CB2R) | hCB2
Type:
G Protein-Coupled Receptor (GPCR)
Mol. Mass.:
39690.94
Organism:
Homo sapiens (Human)
Description:
P34972
Residue:
360
  
Inhibitor
Name:
BDBM529437
Synonyms:
US11202743, Compound 3
Type:
Small organic molecule
Emp. Form.:
C21H37NO3
Mol. Mass.:
351.5234
SMILES:
CCCCCC\C=C\C=C\CCCCCCCC(=O)NCCC(O)=O
: