Target
Fatty-acid amide hydrolase 1
Ligand
BDBM529443
Substrate
Meas. Tech.
FAAH, CB1, and CB2 Inhibition Assay
IC50
13000±n/a nM
Citation
 Au, VHarichian, BMarrero, D Personal care compositions comprising fatty acid amide derivatives US Patent  US11202743 Publication Date 12/21/2021 
Target
Name:
Fatty-acid amide hydrolase 1
Synonyms:
Anandamide amidohydrolase FAAH FAAH1_HUMAN Fatty-acid amide hydrolase (FAAH) Oleamide hydrolase 1
Type:
Protein
Mol. Mass.:
63071.19
Organism:
Homo sapiens (Human)
Description:
O00519
Residue:
579
  
Inhibitor
Name:
BDBM529443
Synonyms:
US11202743, Compound 9
Type:
Small organic molecule
Emp. Form.:
C25H41N3O3
Mol. Mass.:
431.6113
SMILES:
CCCCC\C=C/C=C/CCCCCCCCC(=O)NCC(Cc1c[nH]cn1)C(O)=O
: