Target
Fatty-acid amide hydrolase 1
Ligand
BDBM529447
Substrate
Meas. Tech.
FAAH, CB1, and CB2 Inhibition Assay
IC50
40000±n/a nM
Citation
 Au, VHarichian, BMarrero, D Personal care compositions comprising fatty acid amide derivatives US Patent  US11202743 Publication Date 12/21/2021 
Target
Name:
Fatty-acid amide hydrolase 1
Synonyms:
Anandamide amidohydrolase FAAH FAAH1_HUMAN Fatty-acid amide hydrolase (FAAH) Oleamide hydrolase 1
Type:
Protein
Mol. Mass.:
63071.19
Organism:
Homo sapiens (Human)
Description:
O00519
Residue:
579
  
Inhibitor
Name:
BDBM529447
Synonyms:
US11202743, Compound 17
Type:
Small organic molecule
Emp. Form.:
C21H41NO4
Mol. Mass.:
371.5545
SMILES:
CCCCCCC(O)CCCCCCCCCCC(=O)NC(C)C(O)=O
: