Target
Cyclin-dependent kinase 4/G1/S-specific cyclin-D1
Ligand
BDBM529896
Substrate
Meas. Tech.
Chelation-Enhanced Fluorescence (CHEF) Assay
Ki
7.20±n/a nM
Citation
 Bhattacharya, SKBehenna, DCCameron, KOChen, PCurto, JMFreeman-Cook, KDJalaie, MKania, RSLian, YNair, SKPalmer, CLPettersson, MYRui, EYSammons, MYang, QZhang, L Anti-proliferative agents for treating PAH US Patent  US11203594 Publication Date 12/21/2021 
Target
Name:
Cyclin-dependent kinase 4/G1/S-specific cyclin-D1
Synonyms:
CDK4/CycD CDK4/Cyclin D1 Cyclin-Dependent Kinase 4 (CDK4) Cyclin-dependent kinase 4/G1/S-specific cyclin D1 | Cyclin-dependent kinase 4/cyclin D1
Type:
Protein Complex
Mol. Mass.:
Description:
CDK4/D1 complexes were purified from insect cells co-infected with baculovirus vectors containing each of the components.
Components:
This complex has 2 components.
Component 1
Name:
Cyclin-dependent kinase 4
Synonyms:
CDK4 Cell division protein kinase 4 PSK-J3
Type:
Enzyme Subunit
Mol. Mass.:
33731.96
Organism:
Homo sapiens (Human)
Description:
P11802
Residue:
303
  
Component 2
Name:
G1/S-specific cyclin-D1
Synonyms:
B-cell lymphoma 1 protein BCL-1 oncogene CCND1 PRAD1 | PRAD1 oncogene
Type:
Enzyme Subunit
Mol. Mass.:
33717.70
Organism:
Homo sapiens (Human)
Description:
Residue:
295
  
Inhibitor
Name:
BDBM529896
Synonyms:
US11203594, Example 6 | US11203594, Example 7
Type:
Small organic molecule
Emp. Form.:
C21H28N4O5
Mol. Mass.:
416.4708
SMILES:
CC(=O)c1c(C)c2cnc(N[C@@H]3CCOC[C@H]3O)nc2n([C@H]2CCC[C@]2(C)O)c1=O
: