Target
Cyclin-dependent kinase 6/G1/S-specific cyclin-D3
Ligand
BDBM529906
Substrate
Meas. Tech.
Chelation-Enhanced Fluorescence (CHEF) Assay
Ki
5.00±n/a nM
Citation
 Bhattacharya, SKBehenna, DCCameron, KOChen, PCurto, JMFreeman-Cook, KDJalaie, MKania, RSLian, YNair, SKPalmer, CLPettersson, MYRui, EYSammons, MYang, QZhang, L Anti-proliferative agents for treating PAH US Patent  US11203594 Publication Date 12/21/2021 
Target
Name:
Cyclin-dependent kinase 6/G1/S-specific cyclin-D3
Synonyms:
CDK6/CycD3 CDK6/G1/S-specific cyclin D3 Cyclin-dependent kinase 6 | Cyclin-dependent kinase 6/G1/S-specific cyclin D3
Type:
Protein
Mol. Mass.:
Description:
Components:
This complex has 2 components.
Component 1
Name:
Cyclin-dependent kinase 6
Synonyms:
CDK6 CDKN6 Cyclin-dependent kinase 6 (CDK 6) | Serine/threonine-protein kinase PLSTIRE
Type:
Enzyme Subunit
Mol. Mass.:
36937.42
Organism:
Homo sapiens (Human)
Description:
Q00534
Residue:
326
  
Component 2
Name:
G1/S-specific cyclin-D3
Synonyms:
CCND3 | CCND3_HUMAN
Type:
Enzyme
Mol. Mass.:
32521.90
Organism:
Homo sapiens (Human)
Description:
P30281
Residue:
292
  
Inhibitor
Name:
BDBM529906
Synonyms:
US11203594, Example 16 | US11203594, Example 17
Type:
Small organic molecule
Emp. Form.:
C21H27FN4O4
Mol. Mass.:
418.4619
SMILES:
CC(=O)c1c(C)c2cnc(N[C@@H]3CCOC[C@H]3O)nc2n([C@@H]2CCC[C@]2(C)F)c1=O
: