Target
Dihydroorotate dehydrogenase (quinone), mitochondrial
Ligand
BDBM530448
Substrate
Meas. Tech.
DHODH enzymatic assay
IC50
27±n/a nM
Citation
 Lindsey, DScott, KZhuming, Z DIHYDROOROTATE DEHYDROGENASE INHIBITORS WIPO 0:0 (2022) Target
Name:
Dihydroorotate dehydrogenase (quinone), mitochondrial
Synonyms:
DHODH Dihydroorotate dehydrogenase Dihydroorotate dehydrogenase, mitochondrial Dihydroorotate oxidase (DHODH) | PYRD_HUMAN
Type:
Enzyme
Mol. Mass.:
42881.33
Organism:
Homo sapiens (Human)
Description:
Q02127
Residue:
395
  
Inhibitor
Name:
BDBM530448
Synonyms:
6-(1-Ethyl-5-(2-hydroxypropan-2-yl)-1H-1,2,4-triazol-3-yl)-7-fluoro-4-isopropyl-2- (o-tolyl)isoquinolin-1(2H)-one. | WO2022070068, Example 20
Type:
Small organic molecule
Emp. Form.:
C26H29FN4O2
Mol. Mass.:
448.5325
SMILES:
CCn1nc(nc1C(C)(C)O)-c1cc2c(cn(-c3ccccc3C)c(=O)c2cc1F)C(C)C
: