Target
Histone deacetylase 2
Ligand
BDBM323709
Substrate
Meas. Tech.
IC50 Assay
IC50
4.00±n/a nM
Citation
 Hooker, JWang, CStrebl-Bantillo, MG HDAC6 inhibitors and imaging agents US Patent  US11207431 Publication Date 12/28/2021 
Target
Name:
Histone deacetylase 2
Synonyms:
Cereblon/Histone deacetylase 2 HDAC2 Histone deacetylase 2 (HDAC2) | Human HDAC2
Type:
Chromatin regulator; hydrolase; repressor
Mol. Mass.:
55356.54
Organism:
Homo sapiens (Human)
Description:
Q92769
Residue:
488
  
Inhibitor
Name:
BDBM323709
Synonyms:
US10188756, Compound CN133 | US11207431, Martinostat
Type:
Small organic molecule
Emp. Form.:
C22H30N2O2
Mol. Mass.:
354.4858
SMILES:
CN(Cc1ccc(\C=C\C(=O)NO)cc1)CC12CC3CC(CC(C3)C1)C2
: