Target
Histone deacetylase 5
Ligand
BDBM19422
Substrate
Meas. Tech.
IC50 Assay
IC50
>33.0±n/a nM
Citation
 Hooker, JWang, CStrebl-Bantillo, MG HDAC6 inhibitors and imaging agents US Patent  US11207431 Publication Date 12/28/2021 
Target
Name:
Histone deacetylase 5
Synonyms:
Antigen NY-CO-9 HDAC5 Histone acetylase 5 (HDAC5) Human HDAC5 | KIAA0600
Type:
Enzyme
Mol. Mass.:
121968.61
Organism:
Homo sapiens (Human)
Description:
Q9UQL6
Residue:
1122
  
Inhibitor
Name:
BDBM19422
Synonyms:
4-(acetylamino)-N-(2-amino-phenyl) benzamide N-(2-aminophenyl)-4-acetamidobenzamide US11207431, Example F | US11377423, CI-994
Type:
Small organic molecule
Emp. Form.:
C15H15N3O2
Mol. Mass.:
269.2985
SMILES:
CC(=O)Nc1ccc(cc1)C(=O)Nc1ccccc1N
: