Target
Histone deacetylase 7
Ligand
BDBM531084
Substrate
Meas. Tech.
IC50 Assay
IC50
36.0±n/a nM
Citation
 Hooker, JWang, CStrebl-Bantillo, MG HDAC6 inhibitors and imaging agents US Patent  US11207431 Publication Date 12/28/2021 
Target
Name:
Histone deacetylase 7
Synonyms:
HD7 HDAC7A Histone acetylase 7 (HDAC7) Human HDAC7
Type:
Chromatin regulator; hydrolase; repressor
Mol. Mass.:
102942.62
Organism:
Homo sapiens (Human)
Description:
Q8WUI4
Residue:
952
  
Inhibitor
Name:
BDBM531084
Synonyms:
US11207431, Example C
Type:
Small organic molecule
Emp. Form.:
C16H22N4O2
Mol. Mass.:
302.3715
SMILES:
CN(c1ncc(cn1)C(=O)NO)C12CC3CC(CC(C3)C1)C2
: