Target
Polyamine deacetylase HDAC10
Ligand
BDBM323718
Substrate
Meas. Tech.
IC50 Assay
IC50
33.0±n/a nM
Citation
 Hooker, JWang, CStrebl-Bantillo, MG HDAC6 inhibitors and imaging agents US Patent  US11207431 Publication Date 12/28/2021 
Target
Name:
Polyamine deacetylase HDAC10
Synonyms:
HD10 HDAC10 Histone deacetylase 10 | Human HDAC10
Type:
Chromatin regulator; hydrolase; repressor
Mol. Mass.:
71431.89
Organism:
Homo sapiens (Human)
Description:
Q969S8
Residue:
669
  
Inhibitor
Name:
BDBM323718
Synonyms:
US10188756, Compound CN149 | US11207431, Example B
Type:
Small organic molecule
Emp. Form.:
C22H29FN2O2
Mol. Mass.:
372.4763
SMILES:
CN(Cc1ccc(\C=C\C(=O)NO)cc1F)CC12CC3CC(CC(C3)C1)C2
: