Target
Polyamine deacetylase HDAC10
Ligand
BDBM531084
Substrate
Meas. Tech.
IC50 Assay
IC50
25.0±n/a nM
Citation
 Hooker, JWang, CStrebl-Bantillo, MG HDAC6 inhibitors and imaging agents US Patent  US11207431 Publication Date 12/28/2021 
Target
Name:
Polyamine deacetylase HDAC10
Synonyms:
HD10 HDAC10 Histone deacetylase 10 | Human HDAC10
Type:
Chromatin regulator; hydrolase; repressor
Mol. Mass.:
71431.89
Organism:
Homo sapiens (Human)
Description:
Q969S8
Residue:
669
  
Inhibitor
Name:
BDBM531084
Synonyms:
US11207431, Example C
Type:
Small organic molecule
Emp. Form.:
C16H22N4O2
Mol. Mass.:
302.3715
SMILES:
CN(c1ncc(cn1)C(=O)NO)C12CC3CC(CC(C3)C1)C2
: