Target
Histone deacetylase 6
Ligand
BDBM531097
Substrate
Meas. Tech.
IC50 Assay
IC50
35.0±n/a nM
Citation
 Hooker, JWang, CStrebl-Bantillo, MG HDAC6 inhibitors and imaging agents US Patent  US11207431 Publication Date 12/28/2021 
Target
Name:
Histone deacetylase 6
Synonyms:
Cereblon/Histone deacetylase 6 HDAC6 Histone deacetylase 6 (HDAC6) KIAA0901 | ORF Names:JM21
Type:
Chromatin regulator; hydrolase; repressor
Mol. Mass.:
131381.51
Organism:
Homo sapiens (Human)
Description:
Q9UBN7
Residue:
1215
  
Inhibitor
Name:
BDBM531097
Synonyms:
US11207431, Example 17 | US11890356, Example 17
Type:
Small organic molecule
Emp. Form.:
C19H26N2O2
Mol. Mass.:
314.4219
SMILES:
ONC(=O)c1ccc(CNCC23CC4CC(CC(C4)C2)C3)cc1
: