Target
Isoform 1 of Metabotropic glutamate receptor 5 (5a)
Ligand
BDBM174132
Substrate
Meas. Tech.
mGluR5 FLIPR Assay
EC50
13±n/a nM
Citation
 Degnan, APMaxwell, DHill, MDFang, HParker, MFYang, FBronson, JJMacor, JE Oxazolidinones as modulators of mGluR5 US Patent  US9688669 Publication Date 6/27/2017 
Target
Name:
Isoform 1 of Metabotropic glutamate receptor 5 (5a)
Synonyms:
GPRC1E GRM5_HUMAN Metabotropic glutamate receptor 5 Metabotropic glutamate receptor 5 (mGlu5a) Metabotropic glutamate receptor 5a (mGluR5) Metabotropic glutamate receptor subtype 5 (mGluR5)
Type:
Enzyme
Mol. Mass.:
128885.13
Organism:
Homo sapiens (Human)
Description:
P41594-2
Residue:
1180
  
Inhibitor
Name:
BDBM174132
Synonyms:
US9688669, Example 10 | US9688669, Example 8
Type:
Small organic molecule
Emp. Form.:
C20H19FN2O3
Mol. Mass.:
354.3749
SMILES:
CC(O)CCC#Cc1cncc(c1)[C@H]1NC(=O)O[C@@H]1c1cccc(F)c1
: