Target
Phosphatidylinositol 3-kinase catalytic subunit type 3
Ligand
BDBM535712
Substrate
Meas. Tech.
PI3KC3 (hVPS34) Kinase Assay
IC50
287±n/a nM
Citation
 Stocking, EMWrasidlo, WJ Morpholine derivates as inhibitors of Vps34 US Patent  US11236079 Publication Date 2/1/2022 
Target
Name:
Phosphatidylinositol 3-kinase catalytic subunit type 3
Synonyms:
BC033004 PIK3C3 Phosphatidylinositol 3-kinase catalytic subunit type 3 (PIK3C3) Phosphoinositide 3-Kinase (PI3K), Vps34 PtdIns-3-kinase type 3 hVPS34
Type:
Enzyme
Mol. Mass.:
101551.30
Organism:
Homo sapiens (Human)
Description:
Recombinant human Vps34 protein was expressed as monomeric GST-fusion and purified.
Residue:
887
  
Inhibitor
Name:
BDBM535712
Synonyms:
5-(6-morpholino-4- (phenylsulfonyl)pyridin-2-yl)-4- (trifluoromethyl)thiazol-2-amine | US11236079, Example 6
Type:
Small organic molecule
Emp. Form.:
C19H17F3N4O3S2
Mol. Mass.:
470.488
SMILES:
Nc1nc(c(s1)-c1cc(cc(n1)N1CCOCC1)S(=O)(=O)c1ccccc1)C(F)(F)F
: