Target
Phosphatidylinositol 3-kinase catalytic subunit type 3
Ligand
BDBM535714
Substrate
Meas. Tech.
PI3KC3 (hVPS34) Kinase Assay
IC50
150±n/a nM
Citation
 Stocking, EMWrasidlo, WJ Morpholine derivates as inhibitors of Vps34 US Patent  US11236079 Publication Date 2/1/2022 
Target
Name:
Phosphatidylinositol 3-kinase catalytic subunit type 3
Synonyms:
BC033004 PIK3C3 Phosphatidylinositol 3-kinase catalytic subunit type 3 (PIK3C3) Phosphoinositide 3-Kinase (PI3K), Vps34 PtdIns-3-kinase type 3 hVPS34
Type:
Enzyme
Mol. Mass.:
101551.30
Organism:
Homo sapiens (Human)
Description:
Recombinant human Vps34 protein was expressed as monomeric GST-fusion and purified.
Residue:
887
  
Inhibitor
Name:
BDBM535714
Synonyms:
5-(6-morpholino-4- phenoxypyridin-2-yl)thiazol-2- amine | US11236079, Example 8
Type:
Small organic molecule
Emp. Form.:
C18H18N4O2S
Mol. Mass.:
354.426
SMILES:
Nc1ncc(s1)-c1cc(Oc2ccccc2)cc(n1)N1CCOCC1
: