Target
Calpain-1 catalytic subunit
Ligand
BDBM535880
Substrate
Meas. Tech.
Assay for the Determination of the Capacity to Inhibit Calpain 1
IC50
0.030±n/a nM
Citation
 Llenas Calvo, JRoyo Expósito, MElezcano Donaire, UVázquez Tatay, EMelgarejo Díaz, MBarranco Gallardo, MIMedina Fuentes, EM Dipeptidyl ketoamide meta-methoxyphenyl derivatives and uses thereof US Patent  US11242312 Publication Date 2/8/2022 
Target
Name:
Calpain-1 catalytic subunit
Synonyms:
CAN1_HUMAN CAPN1 Calpain-1 (u-Calpain) Calpain1
Type:
Protein
Mol. Mass.:
81880.51
Organism:
Homo sapiens (Human)
Description:
Residue:
714
  
Inhibitor
Name:
BDBM535880
Synonyms:
US11242312, Example 1
Type:
Small organic molecule
Emp. Form.:
C27H33N3O5
Mol. Mass.:
479.568
SMILES:
COc1cccc(c1)C(=O)N[C@@H](CC(C)C)C(=O)N[C@@H](Cc1ccccc1)C(=O)C(=O)NC1CC1
: