Target
[Pyruvate dehydrogenase (acetyl-transferring)] kinase isozyme 2, mitochondrial
Ligand
BDBM426345
Substrate
Meas. Tech.
Biochemical Activity Testing of PDHK2
IC50
1650±n/a nM
Citation
 Buchstaller, H Bicyclic heterocyclic derivatives US Patent  US11261185 Publication Date 3/1/2022 
Target
Name:
[Pyruvate dehydrogenase (acetyl-transferring)] kinase isozyme 2, mitochondrial
Synonyms:
PDHK2 PDK2_HUMAN Pyruvate dehydrogenase kinase isoenzyme 1 (PDK2)
Type:
Enzyme
Mol. Mass.:
46153.78
Organism:
Homo sapiens (Human)
Description:
Q15119
Residue:
407
  
Inhibitor
Name:
BDBM426345
Synonyms:
US10526325, Compound A21 US11261185, Example 21
Type:
Small organic molecule
Emp. Form.:
C17H16F5N3O2
Mol. Mass.:
389.3199
SMILES:
C[C@H]1CN(Cc2cnn(c12)-c1ccc(F)cc1F)C(=O)[C@@](C)(O)C(F)(F)F
: