Target
5'-AMP-activated protein kinase catalytic subunit alpha-1
Ligand
BDBM543474
Substrate
Meas. Tech.
In Vitro pAMPK1 Kinase Activation Assay
EC50
1123±n/a nM
Citation
 Sebhat, IHe, S AMPK activators US Patent  US11279702 Publication Date 3/22/2022 
Target
Name:
5'-AMP-activated protein kinase catalytic subunit alpha-1
Synonyms:
AAPK1_HUMAN AMP-activated protein kinase alpha-1/beta-2/gamma-2 AMPK subunit alpha-1 AMPK1 PRKAA1 | Tau-protein kinase PRKAA1
Type:
Protein
Mol. Mass.:
64023.62
Organism:
Homo sapiens (Human)
Description:
Q13131
Residue:
559
  
Inhibitor
Name:
BDBM543474
Synonyms:
2-((6-chloro-5-(4'-(3,3-dimethylbutyl)-2'- hydroxy-[1,1'-biphenyl]-4-yl)-1H- imidazo[4,5-b]pyridin-2-yl)thio)acetic acid | US11279702, Compound 6
Type:
Small organic molecule
Emp. Form.:
C26H26ClN3O3S
Mol. Mass.:
496.021
SMILES:
CC(C)(C)CCc1ccc(c(O)c1)-c1ccc(cc1)-c1nc2nc(SCC(O)=O)[nH]c2cc1Cl
: