Target
5'-AMP-activated protein kinase catalytic subunit alpha-1
Ligand
BDBM543476
Substrate
Meas. Tech.
In Vitro pAMPK1 Kinase Activation Assay
EC50
20.0±n/a nM
Citation
 Sebhat, IHe, S AMPK activators US Patent  US11279702 Publication Date 3/22/2022 
Target
Name:
5'-AMP-activated protein kinase catalytic subunit alpha-1
Synonyms:
AAPK1_HUMAN AMP-activated protein kinase alpha-1/beta-2/gamma-2 AMPK subunit alpha-1 AMPK1 PRKAA1 | Tau-protein kinase PRKAA1
Type:
Protein
Mol. Mass.:
64023.62
Organism:
Homo sapiens (Human)
Description:
Q13131
Residue:
559
  
Inhibitor
Name:
BDBM543476
Synonyms:
2-((5-(4'-(1H-1,2,4-triazol-1-yl)-[1,1'- biphenyl]-4-yl)-6-chloro-1H-imidazo[4,5- b]pyridin-2-yl)thio)acetic acid | US11279702, Compound 8
Type:
Small organic molecule
Emp. Form.:
C22H15ClN6O2S
Mol. Mass.:
462.912
SMILES:
OC(=O)CSc1nc2nc(c(Cl)cc2[nH]1)-c1ccc(cc1)-c1ccc(cc1)-n1cncn1
: