Target
Tyrosine-protein kinase JAK1 [837-1142]
Ligand
BDBM400486
Substrate
Meas. Tech.
In Vitro JAK Kinase Assay
IC50
<5±n/a nM
Citation
 Huang, TXue, C Piperidin-4-yl azetidine derivatives as JAK1 inhibitors US Patent  US11285140 Publication Date 3/29/2022 
Target
Name:
Tyrosine-protein kinase JAK1 [837-1142]
Synonyms:
JAK1 JAK1A JAK1_HUMAN Tyrosine-protein kinase JAK1 (837-1142) | Tyrosine-protein kinase JAK1 (aa 837-1142)
Type:
Mol. Mass.:
35230.04
Organism:
Homo sapiens (Human)
Description:
P23458[837-1142]
Residue:
306
  
Inhibitor
Name:
BDBM400486
Synonyms:
US10695337, Example 241 US9999619, Example 241 | {1-[8-(2-Chloro-3,6-difluorobenzyl)-8-azabicyclo[3.2.1]oct-3-yl]-3-[4-(7H-pyrrolo[2,3-d]pyrimidin-4-yl)-1H-pyrazol-1-yl]azetidin-3-yl}acetonitrile
Type:
Small organic molecule
Emp. Form.:
C28H27ClF2N8
Mol. Mass.:
549.017
SMILES:
Fc1ccc(F)c(CN2C3CCC2CC(C3)N2CC(CC#N)(C2)n2cc(cn2)-c2ncnc3[nH]ccc23)c1Cl
: