Target
Tyrosine-protein kinase JAK1 [837-1142]
Ligand
BDBM400554
Substrate
Meas. Tech.
In Vitro JAK Kinase Assay
IC50
<5±n/a nM
Citation
 Huang, TXue, C Piperidin-4-yl azetidine derivatives as JAK1 inhibitors US Patent  US11285140 Publication Date 3/29/2022 
Target
Name:
Tyrosine-protein kinase JAK1 [837-1142]
Synonyms:
JAK1 JAK1A JAK1_HUMAN Tyrosine-protein kinase JAK1 (837-1142) | Tyrosine-protein kinase JAK1 (aa 837-1142)
Type:
Mol. Mass.:
35230.04
Organism:
Homo sapiens (Human)
Description:
P23458[837-1142]
Residue:
306
  
Inhibitor
Name:
BDBM400554
Synonyms:
US10695337, Example 310 US9999619, Example 310
Type:
Small organic molecule
Emp. Form.:
C27H27ClN8O
Mol. Mass.:
515.009
SMILES:
Clc1ccccc1NC(=O)N1CCC(CC1)N1CC(CC#N)(C1)n1cc(cn1)-c1ccnc2[nH]ccc12
: