Target
Estrogen-related receptor gamma
Ligand
BDBM544469
Substrate
Meas. Tech.
Binding Assay
IC50
26.0±n/a nM
Citation
 Hwang, SYCho, SJKim, JChin, JHwang, HLee, IJeon, YLee, JJeon, JKim, SW Aryl ethene derivative and pharmaceutical composition containing same as active ingredient US Patent  US11285226 Publication Date 3/29/2022 
Target
Name:
Estrogen-related receptor gamma
Synonyms:
ERR gamma-2 ERR3_HUMAN ESRRG Estrogen-Related Receptor, gamma KIAA0832 Nuclear receptor subfamily 3 group B member 3
Type:
PROTEIN
Mol. Mass.:
51305.00
Organism:
Homo sapiens (Human)
Description:
ChEMBL_1501351
Residue:
458
  
Inhibitor
Name:
BDBM544469
Synonyms:
87 | US11285226, Compound 27a
Type:
Small organic molecule
Emp. Form.:
C31H39N3O3S
Mol. Mass.:
533.725
SMILES:
CC(C)N1CCN(CC1)c1ccc(cc1)C(=C(\CCCO)c1ccccc1)\c1ccc(NS(C)(=O)=O)cc1
: