Target
Non-receptor tyrosine-protein kinase TYK2
Ligand
BDBM305818
Substrate
Meas. Tech.
JAK Caliper Enzyme Assay at 1 mM ATP
IC50
35.0±n/a nM
Citation
 Brown, MFDermenci, AFensome, AGerstenberger, BSHayward, MMOwen, DRWright, SWXing, LHYang, X Pyrazolo[1,5-A]PYRAZIN-4-YL derivatives US Patent  US10144738 Publication Date 12/4/2018 
Target
Name:
Non-receptor tyrosine-protein kinase TYK2
Synonyms:
Non-receptor tyrosine-protein kinase TYK2 (TYK2) TYK2_HUMAN | Tyrosine-protein kinase TYK2
Type:
Protein
Mol. Mass.:
133666.03
Organism:
Homo sapiens (Human)
Description:
P29597
Residue:
1187
  
Inhibitor
Name:
BDBM305818
Synonyms:
2-((2R,3S)-2-Methyl-3-(4-(6-(1-methyl-1H-pyrazol-4-yl)pyrazolo[1,5-a]pyrazin-4-yl)-1H-pyrazol-1-yl)-1-(2,2,2-trifluoroethyl)azetidin-3-yl)acetonitrile US10822341, Example 17 | US11472809, Example 17
Type:
Small organic molecule
Emp. Form.:
C21H20F3N9
Mol. Mass.:
455.439
SMILES:
C[C@H]1N(CC(F)(F)F)C[C@]1(CC#N)n1cc(cn1)-c1nc(cn2nccc12)-c1cnn(C)c1
: