Target
Voltage-dependent calcium channel gamma-8 subunit
Ligand
BDBM551152
Substrate
Meas. Tech.
Calcium Flux Assay
IC50
0.032±n/a nM
Citation
 Ameriks, MKBerry, CGChen, GRavula, SSavall, BMSwanson, DMWu, DZhang, W Azabenzimidazoles and their use as AMPA receptor modulators US Patent  US11312712 Publication Date 4/26/2022 
Target
Name:
Voltage-dependent calcium channel gamma-8 subunit
Synonyms:
CACNG6 CCG8_HUMAN TARP gamma-8 | Transmembrane AMPAR regulatory protein gamma-8
Type:
Enzyme Catalytic Domain
Mol. Mass.:
43326.96
Organism:
Homo sapiens (Human)
Description:
Q8WXS5
Residue:
425
  
Inhibitor
Name:
BDBM551152
Synonyms:
3-(7-Chloro-1H-indazol-5-yl)-5-(difluoromethyl)-2-isopropyl-imidazo[4,5- | US11312712, Example 269
Type:
Small organic molecule
Emp. Form.:
C17H14ClF2N5
Mol. Mass.:
361.776
SMILES:
CC(C)c1nc2ccc(nc2n1-c1cc(Cl)c2[nH]ncc2c1)C(F)F
: