Target
Voltage-dependent calcium channel gamma-8 subunit
Ligand
BDBM551214
Substrate
Meas. Tech.
Calcium Flux Assay
IC50
0.040±n/a nM
Citation
 Ameriks, MKBerry, CGChen, GRavula, SSavall, BMSwanson, DMWu, DZhang, W Azabenzimidazoles and their use as AMPA receptor modulators US Patent  US11312712 Publication Date 4/26/2022 
Target
Name:
Voltage-dependent calcium channel gamma-8 subunit
Synonyms:
CACNG6 CCG8_HUMAN TARP gamma-8 | Transmembrane AMPAR regulatory protein gamma-8
Type:
Enzyme Catalytic Domain
Mol. Mass.:
43326.96
Organism:
Homo sapiens (Human)
Description:
Q8WXS5
Residue:
425
  
Inhibitor
Name:
BDBM551214
Synonyms:
5-(2-Isopropyl-1H-pyrrolo[2,3-b]pyridin-1-yl)-7-methyl-1H-indazole; | US11312712, Example 332
Type:
Small organic molecule
Emp. Form.:
C18H18N4
Mol. Mass.:
290.3623
SMILES:
CC(C)c1cc2cccnc2n1-c1cc(C)c2[nH]ncc2c1
: