Target
Voltage-dependent calcium channel gamma-8 subunit
Ligand
BDBM551218
Substrate
Meas. Tech.
Calcium Flux Assay
IC50
0.010±n/a nM
Citation
 Ameriks, MKBerry, CGChen, GRavula, SSavall, BMSwanson, DMWu, DZhang, W Azabenzimidazoles and their use as AMPA receptor modulators US Patent  US11312712 Publication Date 4/26/2022 
Target
Name:
Voltage-dependent calcium channel gamma-8 subunit
Synonyms:
CACNG6 CCG8_HUMAN TARP gamma-8 | Transmembrane AMPAR regulatory protein gamma-8
Type:
Enzyme Catalytic Domain
Mol. Mass.:
43326.96
Organism:
Homo sapiens (Human)
Description:
Q8WXS5
Residue:
425
  
Inhibitor
Name:
BDBM551218
Synonyms:
5-[2-(Difluoromethyl)-6-(trifluoromethyl)pyrrolo[2,3-b]pyridin-1-yl]-7-methyl- | US11312712, Example 336
Type:
Small organic molecule
Emp. Form.:
C18H12F5N3O
Mol. Mass.:
381.2994
SMILES:
Cc1cc(cc2CC(=O)Nc12)-n1c(cc2ccc(nc12)C(F)(F)F)C(F)F
: