Target
Non-receptor tyrosine-protein kinase TYK2
Ligand
BDBM305809
Substrate
Meas. Tech.
JAK Caliper Enzyme Assay at 1 mM ATP
IC50
11.0±n/a nM
Citation
 Brown, MFDermenci, AFensome, AGerstenberger, BSHayward, MMOwen, DRWright, SWXing, LHYang, X Pyrazolo[1,5-A]PYRAZIN-4-YL derivatives US Patent  US10144738 Publication Date 12/4/2018 
Target
Name:
Non-receptor tyrosine-protein kinase TYK2
Synonyms:
Non-receptor tyrosine-protein kinase TYK2 (TYK2) TYK2_HUMAN | Tyrosine-protein kinase TYK2
Type:
Protein
Mol. Mass.:
133666.03
Organism:
Homo sapiens (Human)
Description:
P29597
Residue:
1187
  
Inhibitor
Name:
BDBM305809
Synonyms:
2-(3-(4-(6-(1-Methyl-1H-pyrazol-4-yl)pyrazolo[1,5-a]pyrazin-4-yl)-1H-pyrazol-1-yl)-1-(methylsulfonyl)azetidin-3-yl)acetonitrile US10822341, Example 8 | US11472809, Example 8
Type:
Small organic molecule
Emp. Form.:
C19H19N9O2S
Mol. Mass.:
437.478
SMILES:
Cn1cc(cn1)-c1cn2nccc2c(n1)-c1cnn(c1)C1(CC#N)CN(C1)S(C)(=O)=O
: